
1. 为什么UART Lite IP核是AXI总线入门的“黄金切口”刚接触FPGA系统级设计的人常被AXI总线的五通道、握手机制、地址对齐、突发传输这些术语绕得头晕。我带过不少某高校数字系统课程的学生他们第一次看到AXI4-Lite协议文档时第一反应不是“怎么用”而是“这玩意儿到底在解决什么问题”。其实AXI不是凭空造出来的复杂规范它是为了解决一个非常具体、非常现实的工程矛盾如何让高速可编程逻辑PL和高性能处理器系统PS之间既保持数据吞吐能力又不把接口逻辑写成一团乱麻。而UART Lite IP核恰恰是Xilinx官方IP库里最轻量、最透明、最“不藏私”的AXI从设备之一。它没有DMA、不支持突发、不处理中断寄存器分组、连地址映射都只占4个32位寄存器——但正因如此它成了AXI总线行为的“显微镜”。你用它不是为了做高性能串口通信而是为了看清AXI信号在真实硬件上是怎么一拍一拍走起来的。比如当你在Vivado里生成一个UART Lite IP并把它挂到Zynq的PS端AXI GP口上再用SDK写一段XUartLite_Send(UartLite, tx_data, 1)背后发生的是CPU发出一次AXI写事务 → AXI总线拉高AWVALID/WDATA/WSTRB → UART Lite IP内部状态机采样地址0x00TX_FIFO寄存器→ 把数据锁存进FIFO → 同时拉高WREADY表示接收完成。整个过程没有缓存、没有重试、没有乱序所有信号变化都能在ILA里抓到毫秒级延迟都可预测。这和用AXI DMA控制器或AXI Ethernet MAC IP完全不是一个学习路径。后者像开一辆带自动挡、ABS、ESP的SUV你踩油门它就走但底盘怎么调校、差速器怎么分配扭矩全被封装了而UART Lite就是一辆拆掉外壳的电动自行车——链条怎么咬合、飞轮怎么空转、刹车片怎么摩擦全都裸露在外。所以我说想真正理解AXI别一上来就啃《AMBA AXI Protocol Specification》先拿UART Lite跑通一个“写地址0x000x41然后串口真打出A”这个闭环。这个闭环里你亲手配置了AXI地址空间、亲手写了驱动里的寄存器偏移、亲手在逻辑分析仪上数了AWREADY和WVALID的时序关系。这种“肉眼可见的因果”是任何仿真波形图都替代不了的实感。提示很多初学者卡在“明明代码写了Xil_Out32(BASEADDR 0x00, 0x41)但串口没输出”根本原因往往不是代码错而是AXI地址映射没对上——UART Lite的寄存器基址在Vivado Block Design里默认是0x4060_0000但你在SDK里定义的BASEADDR如果写成0x40600000少了个下划线编译器不会报错硬件却永远收不到请求。这种细节只有亲手搭一遍UART Lite才能刻进肌肉记忆。2. UART Lite IP核的AXI接口信号解剖从协议文档到物理引脚AXI协议文档里动辄几十页的时序图对新手来说就像天书。但UART Lite的AXI接口只用了AXI4-Lite最精简的子集总共就15根信号线不含时钟复位我们完全可以逐根“翻译”成工程师能听懂的大白话。这不是照搬手册而是结合实际调试经验告诉你每一根线在真实板子上“干了什么活”。2.1 写地址通道AW告诉设备“我要往哪写”awaddr[31:0]32位地址总线。UART Lite只用了最低两位因为只有4个寄存器所以实际有效位是awaddr[1:0]。当awaddr[1:0] 2b00时对应TX_FIFO发送FIFO2b01对应RX_FIFO接收FIFO2b10对应STATUS_REG状态寄存器2b11对应CONTROL_REG控制寄存器。这里有个关键细节Vivado自动生成的地址映射表里UART Lite的基地址是0x4060_0000那么写TX_FIFO的实际地址就是0x4060_0000 0x00 0x4060_0000。但如果你在SDK里用Xil_Out32(0x40600000, 0x41)而Vivado里该IP的地址范围被配置成0x4060_0000~0x4060_0FFF那请求会直接被AXI Interconnect丢弃——因为地址没落在有效窗口内。所以地址对齐不是玄学是物理连接的硬约束。awvalid与awready这是AXI的“握手”起点。CPU端Master把地址准备好后拉高awvalid等待从设备Slave即UART Lite拉高awready才认为地址被接受。实测中UART Lite的awready几乎是即时响应的1个周期延迟因为它内部没有复杂的地址译码逻辑就是一个简单的2位比较器。但如果你把UART Lite挂在一个带缓存的AXI Interconnect后面awready可能会被延迟几个周期——这就是为什么初学者常看到ILA里awvalid和awready不同时拉高误以为是IP坏了其实是互连结构引入的流水线级数。awprot[2:0]保护类型信号标示访问权限如普通/特权、数据/指令、安全/非安全。UART Lite作为纯数据外设对这个信号完全忽略内部逻辑直接接地。这意味着即使你在SDK里用Xil_Out32()发起非特权访问UART Lite照样收——它不认这套“身份认证”这也是它“Lite”的体现。2.2 写数据通道W把数据“塞”进设备wdata[31:0]与wstrb[3:0]32位数据总线4位字节使能。UART Lite是32位AXI从设备但它的TX_FIFO寄存器只用低8位bit[7:0]高位全为0。所以当你写Xil_Out32(BASEADDR, 0x00000041)时wdata 0x00000041wstrb 4b0001只使能最低字节。这里有个易错点如果误写Xil_Out32(BASEADDR, 0x41000000)wstrb还是0001但wdata的0x41在最高字节UART Lite会把0x00低8位写进TX_FIFO结果串口输出空字符。所以wstrb不是摆设它是硬件级的“数据定位器”。wvalid与wready数据有效信号和接收就绪信号。UART Lite的wready同样响应极快但有一个隐藏条件只有当TX_FIFO未满STATUS_REG[2] 0时wready才为高。如果FIFO已满wready会拉低CPU必须等待——这就是AXI的流控机制。我在某次调试中发现串口输出卡顿抓波形发现wvalid一直高但wready间歇性拉低查STATUS_REG才发现软件没及时读取RX_FIFO导致UART Lite内部状态机认为“忙”连带影响TX路径。AXI的流控不是理论是会实实在在卡住你的数据流的。2.3 写响应通道B给CPU一个“收到”的回执bresp[1:0]与bvalid/bready写响应通道。UART Lite永远返回bresp 2b00OKAY表示写操作成功。bvalid在wready拉高后的下一个周期置高bready由CPU端提供。这个通道的存在是为了让CPU知道“我发的数据对方确实收下了”避免在总线异常如从设备掉电时CPU无限等待。虽然UART Lite几乎不会出错但AXI协议强制要求这个响应环路这是系统可靠性的底层契约。2.4 读地址与读数据通道AR/R把设备里的数据“掏”出来araddr[31:0]读地址逻辑同awaddr只是指向RX_FIFO或STATUS_REG。rdata[31:0]与rresp[1:0]读数据和响应。读RX_FIFO时rdata[7:0]返回接收到的字节读STATUS_REG时rdata[7:0]返回状态位bit[0]TX_FIFO空bit[1]RX_FIFO满bit[2]TX_FIFO满等。rresp同样恒为OKAY。rvalid与rready读数据有效与接收就绪。UART Lite的rvalid在arready拉高后1周期置高但rready由CPU控制——如果CPU不拉高rreadyrvalid会一直保持数据不会被采样。这解释了为什么有些驱动里要加while(!(Xil_In32(BASEADDR 0x04) 0x01));等待RX_FIFO非空而不是直接读——因为读操作本身需要rready配合软件必须主动“取”硬件才“给”。注意AXI协议规定awvalid/wvalid/arvalid可以连续发出多个请求形成“管道化”访问。但UART Lite作为Lite版本内部没有请求队列它只支持单拍single-beat访问。这意味着如果你在SDK里连续执行两次Xil_Out32()第二次的awvalid必须等到第一次的bvalid返回后才能发出。否则AXI Interconnect会插入等待周期Wait State导致实际吞吐率远低于理论值。这个限制不是bug是Lite IP的设计哲学牺牲性能换取确定性。3. 从Block Design到SDK手把手搭建AXI-UART Lite完整链路光看信号不够必须动手搭一个能跑起来的最小系统。下面以Zynq-7000系列如Zybo Z7为例还原一个从Vivado创建工程、到SDK写驱动、再到串口输出“Hello AXI”的全流程。每一步都标注了新手最容易栽跟头的“地雷点”。3.1 Vivado工程Block Design里的三处关键配置第一步新建Vivado工程选择目标器件进入Create Block Design。核心操作就三步添加ZYNQ7 Processing System IP双击配置在Page 1的“PS-PL Configuration”里确保“GP Master AXI Interface”下的S_AXI_GP0被勾选启用。这是PS端通往PL的“主干道”没开它后面所有AXI从设备都连不上。很多人做完设计后发现SDK里看不到AXI外设90%是因为这一步漏了。添加AXI UARTLITE IP在IP Catalog里搜“uartlite”拖入画布。双击配置在“Configuration”页把“Enable Interrupts”取消勾选初学先关中断避免复杂度爆炸在“IO Ports”页确认s_axi_aclk连到ZYNQ的FCLK_CLK0通常100MHzs_axi_aresetn连到ZYNQ的ARESETN。这里有个坑s_axi_aresetn是低电平复位而ZYNQ输出的ARESETN是高电平有效复位信号Vivado会自动插入一个反相器但如果你手动连错了IP会一直处于复位态所有寄存器读出来都是0。地址分配与连线右键ZYNQ IP选“Run Block Automation”勾选“Apply board preset”自动适配开发板管脚。然后右键空白处“Validate Design”此时Vivado会弹出地址分配窗口。找到UARTLITE_0点击“Edit Address”在Address Editor里把Base Address设为0x40600000十六进制Range设为64K0x10000。这个64K不是随便写的——AXI Interconnect要求从设备地址范围必须是2的幂次且不能小于4KB。设太小如4KB后续加其他IP可能地址冲突设太大如1MB浪费地址空间。0x40600000是Xilinx官方例程常用地址兼容性最好。完成连线后Generate Output Products → Create HDL Wrapper → Generate Bitstream。Bitstream生成成功说明硬件层面的AXI连接已经物理打通。3.2 SDK工程驱动编写中的四个“魔鬼细节”Bitstream下载到板子后打开SDK创建Application Project。关键不在代码多炫酷而在四个决定成败的细节BSP配置必须开启AXI支持在SDK里右键你的BSP项目 → “Board Support Package Settings” → “Overview”页勾选“ps7_uart_0”这是PS端的UART用于打印调试信息和“axi_uartlite_0”PL端的UART Lite。更重要的是在“Drivers”页找到axi_uartlite驱动点开其Advanced选项卡把USE_AXI_LITE设为true。如果不设SDK会默认用PS端UART驱动去操作PL端IP必然失败。头文件包含路径在application.c开头除了标准库必须加#include xparameters.h // 自动生成的硬件参数 #include xuartlite.h // UART Lite驱动API #include xil_io.h // AXI底层读写宏其中xparameters.h是Vivado导出硬件时自动生成的里面定义了XPAR_AXI_UARTLITE_0_BASEADDR等宏。新手常犯的错误是直接写死0x40600000一旦Vivado里改了地址代码就失效。用宏才是工程化做法。初始化与寄存器操作的时序陷阱UART Lite上电后TX_FIFO和RX_FIFO默认为空但STATUS_REG的初始值不是全0。实测发现刚上电时STATUS_REG[0]TX_FIFO空为1但STATUS_REG[2]TX_FIFO满也为1——这是一个瞬态竞争状态。所以驱动里不能一上来就写TX_FIFO必须先读STATUS_REG并等待TX_FIFO_EMPTY置位。正确写法u32 status; do { status Xil_In32(XPAR_AXI_UARTLITE_0_BASEADDR 0x04); // 读STATUS_REG } while ((status 0x01) 0); // 等待bit01空 Xil_Out32(XPAR_AXI_UARTLITE_0_BASEADDR 0x00, H); // 写TX_FIFO波特率设置的硬件真相UART Lite的波特率不是软件配置的而是由S_AXI_ACLK时钟频率和IP核内部的分频系数决定的。在Vivado里双击UARTLITE IPConfiguration页的“Baud Rate”下拉菜单只是个提示真正起作用的是C_BAUDRATE_DIV参数在IP的.tcl配置文件里。例如S_AXI_ACLK100MHz要得到115200bps分频系数100000000 / (16 * 115200) ≈ 54.25取整为54。所以波特率精度取决于时钟源和分频计算软件里没有set_baudrate()函数——这是硬件定义的刚性约束。3.3 硬件验证用ILA抓取AXI信号的实战技巧最后一步也是最能建立“手感”的一步用Vivado的Integrated Logic AnalyzerILA抓取真实信号。这比看仿真波形有用十倍。触发点选择在Block Design里右键UARTLITE_0的s_axi_*信号线 → “Set as Debug”。重点勾选s_axi_awvalid,s_axi_awaddr,s_axi_wvalid,s_axi_wdata,s_axi_wstrb,s_axi_bvalid,s_axi_arvalid,s_axi_rvalid,s_axi_rdata。不要全选信号太多会撑爆ILA资源。触发条件设置在Vivado Hardware Manager里加载.bit和.ltx文件后打开ILA窗口。设置Trigger Setups_axi_awvalid 1 s_axi_awaddr 0x40600000写TX_FIFO的地址。这样一执行Xil_Out32(0x40600000, H)ILA就精准捕获这一拍。波形解读心法抓到波形后看三组关键时间关系awvalid拉高后awready是否在1-2周期内响应如果不是检查AXI Interconnect配置。wvalid拉高时wstrb是否为0001wdata[7:0]是否等于0x48H的ASCIIbvalid是否在wvalidwready同为高后的下一周期拉高如果延迟很长说明AXI总线上有其他主设备在争抢带宽。我曾用这个方法帮某公司工程师定位了一个诡异问题串口输出随机乱码。抓波形发现wdata正确但wstrb偶尔变成0010使能第2字节查代码发现是Xil_Out32()被误用为Xil_Out8()导致32位写操作覆盖了相邻寄存器。ILA不撒谎它把硬件的诚实刻在了每一个上升沿上。4. AXI Lite与AXI Full的本质差异为什么UART Lite不支持突发传输很多初学者会困惑既然AXI是“高级可扩展接口”为什么UART Lite这么“简陋”连最基本的突发Burst传输都不支持这背后是Xilinx对IP核定位的深思熟虑也揭示了AXI协议族的分层设计哲学。4.1 协议层级的“职责分离”Lite版是AXI的“最小可行接口”AXI协议分为AXI3、AXI4、AXI4-Lite三个主要变体。它们的关系不是“升级版”而是“场景特化版”。AXI4-Full是为高性能互联如CPU与DDR控制器、GPU与视频编码器设计的它支持突发传输Burst一次地址请求连续传输1-256个数据拍极大提升带宽利用率乱序完成Out-of-order completion不同地址的读写请求可以交叉返回隐藏内存延迟独占访问Exclusive access用于实现原子操作保障多核同步。而AXI4-Lite顾名思义是AXI4的“轻量裁剪版”它砍掉了所有为高性能优化的复杂机制只保留最核心的读写能力。它的设计信条是确定性优先于吞吐率简单性优先于灵活性。UART Lite正是这一信条的完美载体。为什么UART Lite不需要突发因为串口本质是字节流设备。你发一个字符UART硬件需要至少10个比特时间1起始8数据1停止才能送出这期间总线是空闲的。如果强行用突发传16个字节意味着CPU要一口气把16字节塞进TX_FIFO但UART硬件只能以固定波特率慢慢吐FIFO很快溢出。所以UART Lite的“单拍写”不是缺陷而是对串口物理特性的精准建模——它强迫软件按硬件节奏来避免了缓冲区管理的复杂性。4.2 寄存器映射的物理约束4个32位寄存器的硬边界翻开UART Lite的官方产品指南PG142它的寄存器映射表只有4行OffsetNameAccessDescription0x00TX_FIFOWOWrite-only FIFO for transmit data0x04RX_FIFORORead-only FIFO for receive data0x08STATUS_REGRORead-only status register0x0CCONTROL_REGWOWrite-only control register注意所有寄存器都是32位宽但实际只用低8位TX/RX_FIFO或低4位STATUS/CONTROL。这个“4×32bit”的布局是AXI Lite协议能支持的最小地址空间单元。AXI Lite要求每个从设备至少占用4KB0x1000地址空间但UART Lite只用了最低的0x10字节16字节剩下的0xFF0字节全是保留的“空洞”。你可以向0x40600010写数据UART Lite不会报错但也不会有任何响应——它内部的地址译码器只认0x00/0x04/0x08/0x0C这四个偏移。这个设计带来了两个关键优势调试友好所有寄存器都在同一页面0x00~0x0F用Xil_In32(BASEADDR offset)就能全覆盖不用记一堆分散地址。资源极致节省UART Lite的RTL代码里地址译码就是一句if (awaddr[1:0] 2b00) begin ... end else if (awaddr[1:0] 2b01) begin ... end没有状态机、没有查找表、没有分支预测。综合后门电路LUT用量不足50个是真正的“胶合逻辑”。4.3 从Lite到Full的演进路径何时该放弃UART Lite当然UART Lite不是万能的。当你的项目需求越过以下任一红线就必须考虑更重的IP需要DMA搬运大量数据比如实时采集ADC数据流并存入DDR。这时应换用AXI DMA AXI Stream FIFO 自定义AXI Stream to UART IP让DMA直接喂数据CPU只管配置。需要精确时序控制比如用UART模拟SPI或I2C时序。UART Lite的发送时序由内部波特率发生器锁定无法微秒级干预需用AXI GPIO 状态机构建软UART。需要多主机仲裁比如PS和PL里的另一个ARM核都要访问同一串口。AXI Lite不支持多主必须上AXI Interconnect AXI SmartConnect甚至引入AXI Coherency ExtensionsACE。我参与过一个某图像处理Demo初期用UART Lite打印调试信息一切顺利当加入实时JPEG压缩模块后CPU频繁访问DDR导致UART Lite的wready被AXI总线延迟串口输出出现明显卡顿。解决方案不是优化UART Lite而是把调试信息改用JTAG UARTPS端输出把PL端UART Lite专用于接收传感器指令——让每个AXI通道各司其职。这印证了一个经验AXI不是越“重”越好而是越“匹配”越好。Lite版的价值正在于它用最轻的重量扛起了最清晰的教育使命。5. 常见故障排查链路从“串口没输出”到“波形全绿”的完整诊断树在真实项目中AXI-UART Lite链路出问题90%的情况不是IP坏了而是某个环节的配置错位。下面是一套我总结的、可逐级执行的排查链路每一步都有对应的验证方法和预期结果帮你把“玄学问题”变成“确定性故障”。5.1 第一层硬件连接验证5分钟目标确认AXI总线物理连通无地址/时钟/复位硬伤。检查点1地址映射是否生效在SDK里执行xil_printf(Base Addr: 0x%08x\r\n, XPAR_AXI_UARTLITE_0_BASEADDR); xil_printf(Read 0x00: 0x%08x\r\n, Xil_In32(XPAR_AXI_UARTLITE_0_BASEADDR 0x00)); xil_printf(Read 0x04: 0x%08x\r\n, Xil_In32(XPAR_AXI_UARTLITE_0_BASEADDR 0x04));预期结果Base Addr必须等于Vivado Address Editor里设置的值如0x40600000Read 0x00和Read 0x04应返回非0xFFFFFFFF的值如0x00000000或0x00000001。如果返回0xFFFFFFFF说明AXI请求被AXI Interconnect丢弃检查Vivado里UART Lite的地址范围是否在Interconnect的有效窗口内。检查点2时钟与复位是否就绪用ILA抓uartlite_0/s_axi_aclk和s_axi_aresetn。预期aclk有稳定方波如100MHzaresetn在FPGA配置完成后保持高电平。如果aresetn一直为低检查ZYNQ IP的Reset Configuration是否正确或尝试在Block Design里手动添加一个proc_sys_resetIP并连接。5.2 第二层协议行为验证10分钟目标确认AXI信号按协议规范交互无握手失败。检查点3写事务是否完成在SDK里执行一次写操作Xil_Out32(XPAR_AXI_UARTLITE_0_BASEADDR 0x00, X);同时用ILA抓awvalid,awready,wvalid,wready,bvalid,bready。预期波形序列awvalid↑→awready↑1拍后→wvalid↑→wready↑1拍后→bvalid↑1拍后→bready↑1拍后。如果awready或wready迟迟不拉高说明UART Lite未退出复位或内部状态机卡死重启FPGA或检查aresetn信号。检查点4读状态寄存器是否可信执行u32 stat Xil_In32(XPAR_AXI_UARTLITE_0_BASEADDR 0x04); xil_printf(STATUS: 0x%08x\r\n, stat);预期stat 0x01TX_FIFO空应为1刚上电时空stat 0x04TX_FIFO满应为0。如果stat恒为0说明读事务失败检查arvalid/rvalid波形如果stat恒为0xFFFFFFFF说明地址译码失败。5.3 第三层功能逻辑验证15分钟目标确认UART硬件行为符合预期无FIFO或波特率异常。检查点5TX_FIFO是否真的接收了数据连续写3个字符Xil_Out32(BASEADDR0x00, A); Xil_Out32(BASEADDR0x00, B); Xil_Out32(BASEADDR0x00, C);用逻辑分析仪或另一台电脑的串口助手监听UART Lite的tx引脚。预期依次输出A、B、C无乱码。如果只输出第一个字符说明后续写操作被wready阻塞——检查STATUS_REG确认TX_FIFO是否已满stat 0x04 1如果是说明波特率太低或未接终端FIFO积压。检查点6波特率是否准确用示波器测tx引脚的比特宽度。例如115200bps下1比特时间≈8.68μs。如果实测为10μs则波特率≈100000bps说明C_BAUDRATE_DIV计算错误。重新计算DIV round(CLK_FREQ / (16 * BAUD))并在Vivado里重新配置UARTLITE IP。5.4 第四层系统级干扰排查20分钟目标排除PS端驱动、OS调度、总线争抢等隐性因素。检查点7PS端UART是否抢占了AXI资源某些BSP配置中PS端UART的驱动会周期性扫描所有AXI外设产生背景流量。关闭PS UART的自动轮询在BSP Settings →ps7_uart_0→Advanced→ENABLE_AUTO_POLLING设为false。检查点8AXI Interconnect的QoS设置如果系统中有多个AXI主设备如PS、DMA、自定义IP在Vivado里双击AXI Interconnect IP → “Interconnect Configuration”检查“Masters”页确保S_AXI_GP0PS的QoS值高于其他主设备。否则PS的AXI请求可能被低优先级主设备饿死。这套排查链路是我帮某实验室调试一个“串口时好时坏”问题时提炼的。最终发现是aresetn信号在FPGA配置完成后有约100ms的毛刺导致UART Lite间歇性复位。用一个RC滤波电路10kΩ100nF平滑后问题彻底消失。AXI的世界里没有“玄学”只有未被发现的物理约束。6. 超越UART LiteAXI总线能力的延展实践建议掌握了UART Lite这个“支点”下一步就是撬动更广阔的AXI世界。这里分享几个经过验证的、低风险高回报的延展方向每个都附带具体实施路径和避坑提示。6.1 方向一用AXI GPIO构建“可编程逻辑开关”UART Lite教你读写寄存器AXI GPIO则教你控制物理世界。它是最简单的AXI从设备只有2个32位寄存器DATA和TRI但能直接驱动LED、按键、继电器。实施路径在Vivado里添加AXI GPIO IP配置为2-channelChannel 1Output接4个LEDChannel 2Input接4个按键。地址设为0x40000000。SDK里用Xil_Out32(BASEADDR, 0xF)点亮所有LED。避坑提示GPIO的TRI寄存器决定方向0输出1输入。必须先写TRI0x0全输出再写DATA否则LED不亮。很多新手忘了这一步以为IP坏了。6.2 方向二用AXI Timer实现“硬件级精准延时”AXI TimerAXI General Purpose Timer提供纳秒级精度的计时器比软件usleep()可靠百倍。实施路径添加AXI Timer IP勾选“Single Shot Mode”。在SDK里写CONTROL_REG0x1启动读VALUE_REG获取剩余计数值。可用于精确控制PWM占空比或ADC采样间隔。避坑提示Timer的时钟源必须与UART Lite一致如FCLK_CLK0否则时间基准错乱。在Vivado里务必检查s_axi_aclk连线。6.3 方向三用AXI BRAM Controller接入“片上高速存储”AXI BRAM Controller把Block RAM变成AXI从设备提供类似SRAM的读写体验。实施路径添加AXI BRAM Controller BRAM IP配置BRAM深度为1024×32bit。地址设为0x40100000。SDK里用Xil_Out32(0x40100000, 0xDEADBEEF)写入Xil_In32(0x40100000)读出验证读写一致性。避坑提示BRAM的EN使能信号必须由AXI BRAM Controller驱动不能悬空。Vivado自动化连线会处理但手动修改时易遗漏。6.4 方向四用AXI Stream协议桥接“高速数据流”当你的需求从“控制”转向“数据搬运”AXI StreamAXI4-Stream就是必经之路。它用TVALID/TREADY握手无地址概念专为视频、音频流设计。实施路径用UART Lite的rx信号作为AXI Stream的tdata源通过自定义IP将字节流打包成AXI Stream帧再送入AXI DMA